Target
Ketohexokinase
Ligand
BDBM130588
Substrate
Meas. Tech.
Enzyme Assay
Temperature
298.15±n/a K
IC50
160±n/a nM
Comments
extracted
Citation
 Zhang, XAbad, MCGibbs, ACKuo, GKuo, LCSong, FSui, Z Indazole compounds useful as ketohexokinase inhibitors US Patent  US8822447 Publication Date 9/2/2014 
Target
Name:
Ketohexokinase
Synonyms:
Hepatic fructokinase KHK_HUMAN Ketohexokinase (KHK) | Ketohexokinase (KHK) Isoform C
Type:
Enzyme Catalytic Domain
Mol. Mass.:
32521.64
Organism:
Homo sapiens (Human)
Description:
Residue:
298
  
Inhibitor
Name:
BDBM130588
Synonyms:
US8822447, 66
Type:
Small organic molecule
Emp. Form.:
C22H17N5O
Mol. Mass.:
367.4033
SMILES:
Cc1nn(-c2ccccc2)c2cc(NC(=O)c3ccc4nc[nH]c4c3)ccc12
: