Target
Ketohexokinase
Ligand
BDBM130619
Substrate
Meas. Tech.
Enzyme Assay
Temperature
298.15±n/a K
IC50
600±n/a nM
Comments
extracted
Citation
 Zhang, XAbad, MCGibbs, ACKuo, GKuo, LCSong, FSui, Z Indazole compounds useful as ketohexokinase inhibitors US Patent  US8822447 Publication Date 9/2/2014 
Target
Name:
Ketohexokinase
Synonyms:
Hepatic fructokinase KHK_HUMAN Ketohexokinase (KHK) | Ketohexokinase (KHK) Isoform C
Type:
Enzyme Catalytic Domain
Mol. Mass.:
32521.64
Organism:
Homo sapiens (Human)
Description:
Residue:
298
  
Inhibitor
Name:
BDBM130619
Synonyms:
US8822447, 99 | US9771375, Example 99
Type:
Small organic molecule
Emp. Form.:
C24H25N5O
Mol. Mass.:
399.4882
SMILES:
Cc1nn(-c2ccccc2)c2nc(cc(CO)c12)-c1ccc(cc1)N1CCNCC1
: