Target
Ketohexokinase
Ligand
BDBM50349741
Substrate
Meas. Tech.
Enzyme Assay
Temperature
298.15±n/a K
IC50
230±n/a nM
Comments
extracted
Citation
 Zhang, XAbad, MCGibbs, ACKuo, GKuo, LCSong, FSui, Z Indazole compounds useful as ketohexokinase inhibitors US Patent  US8822447 Publication Date 9/2/2014 
Target
Name:
Ketohexokinase
Synonyms:
Hepatic fructokinase KHK_HUMAN Ketohexokinase (KHK) | Ketohexokinase (KHK) Isoform C
Type:
Enzyme Catalytic Domain
Mol. Mass.:
32521.64
Organism:
Homo sapiens (Human)
Description:
Residue:
298
  
Inhibitor
Name:
BDBM50349741
Synonyms:
CHEMBL1809168 US9771375, Example 139
Type:
Small organic molecule
Emp. Form.:
C19H18FN3S
Mol. Mass.:
339.43
SMILES:
CSc1nn(-c2ccc(F)cc2)c2cc(ccc12)C1=CCNCC1
: