Target
Ketohexokinase
Ligand
BDBM50349744
Substrate
Meas. Tech.
Enzyme Assay
Temperature
298.15±n/a K
IC50
90±n/a nM
Comments
extracted
Citation
 Zhang, XAbad, MCGibbs, ACKuo, GKuo, LCSong, FSui, Z Indazole compounds useful as ketohexokinase inhibitors US Patent  US8822447 Publication Date 9/2/2014 
Target
Name:
Ketohexokinase
Synonyms:
Hepatic fructokinase KHK_HUMAN Ketohexokinase (KHK) | Ketohexokinase (KHK) Isoform C
Type:
Enzyme Catalytic Domain
Mol. Mass.:
32521.64
Organism:
Homo sapiens (Human)
Description:
Residue:
298
  
Inhibitor
Name:
BDBM50349744
Synonyms:
CHEMBL1809171 US9771375, Example 140
Type:
Small organic molecule
Emp. Form.:
C20H21N3OS
Mol. Mass.:
351.465
SMILES:
COc1ccc(cc1)-n1nc(SC)c2ccc(cc12)C1=CCNCC1
: