Target
Ketohexokinase
Ligand
BDBM130646
Substrate
Meas. Tech.
Enzyme Assay
Temperature
298.15±n/a K
IC50
480±n/a nM
Comments
extracted
Citation
 Zhang, XAbad, MCGibbs, ACKuo, GKuo, LCSong, FSui, Z Indazole compounds useful as ketohexokinase inhibitors US Patent  US8822447 Publication Date 9/2/2014 
Target
Name:
Ketohexokinase
Synonyms:
Hepatic fructokinase KHK_HUMAN Ketohexokinase (KHK) | Ketohexokinase (KHK) Isoform C
Type:
Enzyme Catalytic Domain
Mol. Mass.:
32521.64
Organism:
Homo sapiens (Human)
Description:
Residue:
298
  
Inhibitor
Name:
BDBM130646
Synonyms:
US8822447, 149 | US9771375, Example 149
Type:
Small organic molecule
Emp. Form.:
C22H24N4OS
Mol. Mass.:
392.517
SMILES:
CSc1nn(-c2ccccc2)c2cc(ccc12)C1=CCN(CC1)C(=O)CCN
: