Target
High affinity cGMP-specific 3',5'-cyclic phosphodiesterase 9A
Ligand
BDBM130740
Substrate
Meas. Tech.
Inhibition Assay
pH
8±n/a
IC50
3±n/a nM
Comments
extracted
Citation
 Kaizawa, HYamamoto, HKamijo, KSugita, MSeo, RYamamoto, SUkai, A Pyrazoloquinoline compound US Patent  US8822448 Publication Date 9/2/2014 
Target
Name:
High affinity cGMP-specific 3',5'-cyclic phosphodiesterase 9A
Synonyms:
PDE9A_RAT Phosphodiesterase 9 (PDE9)
Type:
Enzyme
Mol. Mass.:
61749.01
Organism:
Rattus norvegicus (Rat)
Description:
Q8QZV1
Residue:
534
  
Inhibitor
Name:
BDBM130740
Synonyms:
US8822448, 139
Type:
Small organic molecule
Emp. Form.:
C25H30F3N5O3
Mol. Mass.:
505.5326
SMILES:
Cc1cc2[nH]c(=O)c3cnn(C4CCOCC4)c3c2cc1C(=O)N1CCN(CCCC(F)(F)F)CC1
: