Target
Insulin receptor
Ligand
BDBM130909
Substrate
Meas. Tech.
In Vitro Kinase Activity Assay
pH
7.5±n/a
IC50
36.35±n/a nM
Comments
extracted
Citation
 Gregor, VE Tyrosine kinase inhibitors US Patent  US8822500 Publication Date 9/2/2014 
Target
Name:
Insulin receptor
Synonyms:
INSR INSR_HUMAN Insulin receptor beta subunit
Type:
Receptor Tyrosine Kinase
Mol. Mass.:
156322.60
Organism:
Homo sapiens (Human)
Description:
P06213
Residue:
1382
  
Inhibitor
Name:
BDBM130909
Synonyms:
US10683289, Example Staurosporine US8822500, Stauro- sporine | US9920060, Staurosporine
Type:
Small organic molecule
Emp. Form.:
C28H26N4O3
Mol. Mass.:
466.531
SMILES:
CNC1CC2OC(C)(C1OC)n1c3ccccc3c3c4CNC(=O)c4c4c5ccccc5n2c4c13
: