Target
Proto-oncogene tyrosine-protein kinase ROS
Ligand
BDBM130912
Substrate
Meas. Tech.
In Vitro Kinase Activity Assay
pH
7.5±n/a
IC50
0.205±n/a nM
Comments
extracted
Citation
 Gregor, VE Tyrosine kinase inhibitors US Patent  US8822500 Publication Date 9/2/2014 
Target
Name:
Proto-oncogene tyrosine-protein kinase ROS
Synonyms:
MCF3 Proto-oncogene c-Ros-1 ROS1 Receptor tyrosine kinase c-ros oncogene 1 c-Ros receptor tyrosine kinase
Type:
Enzyme
Mol. Mass.:
263897.39
Organism:
Homo sapiens (Human)
Description:
P08922
Residue:
2347
  
Inhibitor
Name:
BDBM130912
Synonyms:
US8822500, [1]
Type:
Small organic molecule
Emp. Form.:
C27H26F4N6O2
Mol. Mass.:
542.528
SMILES:
C[C@@H](Cc1c(F)c(F)cc(F)c1F)Nc1cc[nH]c(=O)c1-c1nc2cc3C(=O)N(CCN(C)C)Cc3cc2[nH]1
: