Target
G-protein coupled receptor 6
Ligand
BDBM190937
Substrate
Meas. Tech.
Inhibition of cAMP Activity of GPR6 In Vitro A.2 Assay
IC50
9100±n/a nM
Citation
 Brown, JWHitchcock, SHopkins, MKikuchi, SMonenschein, HReichard, HSchleicher, KSun, HMacklin, T Substituted pyrido[3,4-b]pyrazines as GPR6 modulators US Patent  US10077266 Publication Date 9/18/2018 
Target
Name:
G-protein coupled receptor 6
Synonyms:
G-protein coupled receptor 6 (GPR6) GPR6_HUMAN | Sphingosine 1-phosphate receptor GPR6
Type:
Protein
Mol. Mass.:
37886.39
Organism:
Homo sapiens (Human)
Description:
P46095
Residue:
362
  
Inhibitor
Name:
BDBM190937
Synonyms:
US10077266, Example 49 US9708313, 49
Type:
Small organic molecule
Emp. Form.:
C23H28F4N6O2
Mol. Mass.:
496.501
SMILES:
CN(C)C(=O)N1CCc2nc(NCC(F)F)c(nc2C1)N1CCC(CC1)Oc1ccc(F)cc1F
: