Target
G-protein coupled receptor 6
Ligand
BDBM190956
Substrate
Meas. Tech.
Inhibition of cAMP Activity of GPR6 In Vitro A.2 Assay
IC50
26500±n/a nM
Citation
 Brown, JWHitchcock, SHopkins, MKikuchi, SMonenschein, HReichard, HSchleicher, KSun, HMacklin, T Substituted pyrido[3,4-b]pyrazines as GPR6 modulators US Patent  US10077266 Publication Date 9/18/2018 
Target
Name:
G-protein coupled receptor 6
Synonyms:
G-protein coupled receptor 6 (GPR6) GPR6_HUMAN | Sphingosine 1-phosphate receptor GPR6
Type:
Protein
Mol. Mass.:
37886.39
Organism:
Homo sapiens (Human)
Description:
P46095
Residue:
362
  
Inhibitor
Name:
BDBM190956
Synonyms:
US10077266, Example 69 US9708313, 69
Type:
Small organic molecule
Emp. Form.:
C23H28F3N5
Mol. Mass.:
431.4971
SMILES:
CN1CCc2nc(NC3CC3)c(nc2C1)N1CCC(CC1)[C@@H](F)c1ccc(F)cc1F
: