Target
Steroid 17-alpha-hydroxylase/17,20 lyase
Ligand
BDBM132102
Substrate
Meas. Tech.
Enzyme Assay
IC50
16±n/a nM
Citation
 Bock, MGGaul, CGunmadi, VRSengupta, S Inhibitors of CYP 17 US Patent  USRE45173 Publication Date 9/30/2014 
Target
Name:
Steroid 17-alpha-hydroxylase/17,20 lyase
Synonyms:
CP17A_RAT Cyp17a1 Cytochrome P450 17A1 Steroid 17-alpha-hydroxylase/17,20 lyase
Type:
Enzyme
Mol. Mass.:
57255.68
Organism:
Rattus norvegicus (Rat)
Description:
P11715
Residue:
507
  
Inhibitor
Name:
BDBM132102
Synonyms:
USRE45173, 7A
Type:
Small organic molecule
Emp. Form.:
C16H13N3OS
Mol. Mass.:
295.359
SMILES:
O=C1N(CCN1c1ccc2sccc2c1)c1cccnc1
: