Target
Gamma-aminobutyric acid receptor subunit alpha-5
Ligand
BDBM133594
Substrate
Meas. Tech.
Radioligand Binding Assay
pH
7.5±n/a
Temperature
277.15±n/a K
Ki
0.5±n/a nM
Comments
extracted
Citation
 Buettelmann, BJakob-Roetne, RKnust, HLucas, MCThomas, A Isoxazolo-pyridine derivatives US Patent  US8846719 Publication Date 9/30/2014 
Target
Name:
Gamma-aminobutyric acid receptor subunit alpha-5
Synonyms:
GABA receptor alpha-5 subunit GABRA5 Gamma-aminobutyric acid receptor subunit alpha-5 (GABA(A)) | Gamma-aminobutyric acid receptor subunit alpha-5 (GABAA)
Type:
Enzyme
Mol. Mass.:
52160.59
Organism:
Homo sapiens (Human)
Description:
P31644
Residue:
462
  
Inhibitor
Name:
BDBM133594
Synonyms:
US8846719, 299
Type:
Small organic molecule
Emp. Form.:
C19H16F4N4O3
Mol. Mass.:
424.349
SMILES:
C[C@H](NC(=O)c1ccc(OCc2c(C)onc2-c2ccc(F)cn2)nc1)C(F)(F)F
: