Target
Gamma-aminobutyric acid receptor subunit alpha-5
Ligand
BDBM11505
Substrate
Meas. Tech.
Radioligand Binding Assay
pH
7.5±n/a
Temperature
277.15±n/a K
Ki
0.6±n/a nM
Comments
extracted
Citation
 Buettelmann, BJakob-Roetne, RKnust, HLucas, MCThomas, A Isoxazolo-pyridine derivatives US Patent  US8846719 Publication Date 9/30/2014 
Target
Name:
Gamma-aminobutyric acid receptor subunit alpha-5
Synonyms:
GABA receptor alpha-5 subunit GABRA5 Gamma-aminobutyric acid receptor subunit alpha-5 (GABA(A)) | Gamma-aminobutyric acid receptor subunit alpha-5 (GABAA)
Type:
Enzyme
Mol. Mass.:
52160.59
Organism:
Homo sapiens (Human)
Description:
P31644
Residue:
462
  
Inhibitor
Name:
BDBM11505
Synonyms:
US8846719, 307
Type:
Emp. Form.:
C20H25ClN4O5S
Mol. Mass.:
468.954
SMILES:
Cc1onc(C2CNCC(Cl)C2)c1COc1ccc(cn1)C(=O)N1CCS(=O)(=O)CC1
: