Target
Cannabinoid receptor 1
Ligand
BDBM143572
Substrate
Meas. Tech.
cAMP Assay
Temperature
300.15±n/a K
EC50
21±n/a nM
Comments
extracted
Citation
 Macielag, MJZhang, YDeCorte, BLGreco, MN Quinazoline derivatives useful as CB-1 inverse agonists US Patent  US9682955 Publication Date 6/20/2017 
Target
Name:
Cannabinoid receptor 1
Synonyms:
CANN6 CB-R CNR CNR1_HUMAN Cannabinoid receptor Cannabinoid receptor 1 (brain)
Type:
G Protein-Coupled Receptor (GPCR)
Mol. Mass.:
52868.96
Organism:
Homo sapiens (Human)
Description:
P21554
Residue:
472
  
Inhibitor
Name:
BDBM143572
Synonyms:
US9682955, 54
Type:
Small organic molecule
Emp. Form.:
C34H30Cl2F3N3O4
Mol. Mass.:
672.521
SMILES:
OCC(CO)(CO)COc1nc(NCc2cccc(c2)C(F)(F)F)c2cc(ccc2n1)C(c1ccc(Cl)cc1)c1ccc(Cl)cc1
: