Target
Cannabinoid receptor 1
Ligand
BDBM143560
Substrate
Meas. Tech.
cAMP Assay
Temperature
300.15±n/a K
EC50
0.50±n/a nM
Comments
extracted
Citation
 Macielag, MJZhang, YDeCorte, BLGreco, MN Quinazoline derivatives useful as CB-1 inverse agonists US Patent  US9682955 Publication Date 6/20/2017 
Target
Name:
Cannabinoid receptor 1
Synonyms:
CANN6 CB-R CNR CNR1_HUMAN Cannabinoid receptor Cannabinoid receptor 1 (brain)
Type:
G Protein-Coupled Receptor (GPCR)
Mol. Mass.:
52868.96
Organism:
Homo sapiens (Human)
Description:
P21554
Residue:
472
  
Inhibitor
Name:
BDBM143560
Synonyms:
US9682955, 58
Type:
Small organic molecule
Emp. Form.:
C33H31ClN4O
Mol. Mass.:
535.078
SMILES:
COc1ccc(cc1)C(c1ccc(Cl)cc1)c1ccc2ncnc(NC3CCN(CC3)c3ccccc3)c2c1
: