Target
Cannabinoid receptor 1
Ligand
BDBM143633
Substrate
Meas. Tech.
cAMP Assay
Temperature
300.15±n/a K
EC50
5299±n/a nM
Comments
extracted
Citation
 Macielag, MJZhang, YDeCorte, BLGreco, MN Quinazoline derivatives useful as CB-1 inverse agonists US Patent  US9682955 Publication Date 6/20/2017 
Target
Name:
Cannabinoid receptor 1
Synonyms:
CANN6 CB-R CNR CNR1_HUMAN Cannabinoid receptor Cannabinoid receptor 1 (brain)
Type:
G Protein-Coupled Receptor (GPCR)
Mol. Mass.:
52868.96
Organism:
Homo sapiens (Human)
Description:
P21554
Residue:
472
  
Inhibitor
Name:
BDBM143633
Synonyms:
US9682955, 60
Type:
Small organic molecule
Emp. Form.:
C29H21Cl2N3O2
Mol. Mass.:
514.402
SMILES:
OC(=O)c1ccc(CNc2ncnc3ccc(cc23)C(c2ccc(Cl)cc2)c2ccc(Cl)cc2)cc1
: