Target
Cannabinoid receptor 1
Ligand
BDBM143561
Substrate
Meas. Tech.
cAMP Assay
Temperature
300.15±n/a K
EC50
14±n/a nM
Comments
extracted
Citation
 Macielag, MJZhang, YDeCorte, BLGreco, MN Quinazoline derivatives useful as CB-1 inverse agonists US Patent  US9682955 Publication Date 6/20/2017 
Target
Name:
Cannabinoid receptor 1
Synonyms:
CANN6 CB-R CNR CNR1_HUMAN Cannabinoid receptor Cannabinoid receptor 1 (brain)
Type:
G Protein-Coupled Receptor (GPCR)
Mol. Mass.:
52868.96
Organism:
Homo sapiens (Human)
Description:
P21554
Residue:
472
  
Inhibitor
Name:
BDBM143561
Synonyms:
US9682955, 62
Type:
Small organic molecule
Emp. Form.:
C30H23Cl2N3O2
Mol. Mass.:
528.429
SMILES:
COC(=O)c1cccc(CNc2ncnc3ccc(cc23)C(c2ccc(Cl)cc2)c2ccc(Cl)cc2)c1
: