Target
Cannabinoid receptor 2
Ligand
BDBM143638
Substrate
Meas. Tech.
cAMP Assay
Temperature
300.15±n/a K
EC50
2940±n/a nM
Comments
extracted
Citation
 Macielag, MJZhang, YDeCorte, BLGreco, MN Quinazoline derivatives useful as CB-1 inverse agonists US Patent  US9682955 Publication Date 6/20/2017 
Target
Name:
Cannabinoid receptor 2
Synonyms:
CANNABINOID CB2 CB2 CB2B CNR2_HUMAN Cannabinoid CB2 receptor Cannabinoid receptor 2 (CB2R) | hCB2
Type:
G Protein-Coupled Receptor (GPCR)
Mol. Mass.:
39690.94
Organism:
Homo sapiens (Human)
Description:
P34972
Residue:
360
  
Inhibitor
Name:
BDBM143638
Synonyms:
US9682955, 65
Type:
Small organic molecule
Emp. Form.:
C28H20Cl2FN3
Mol. Mass.:
488.383
SMILES:
Fc1ccc(CNc2ncnc3ccc(cc23)C(c2ccc(Cl)cc2)c2ccc(Cl)cc2)cc1
: