Target
Cannabinoid receptor 1
Ligand
BDBM143555
Substrate
Meas. Tech.
cAMP Assay
Temperature
300.15±n/a K
EC50
950±n/a nM
Comments
extracted
Citation
 Macielag, MJZhang, YDeCorte, BLGreco, MN Quinazoline derivatives useful as CB-1 inverse agonists US Patent  US9682955 Publication Date 6/20/2017 
Target
Name:
Cannabinoid receptor 1
Synonyms:
CANN6 CB-R CNR CNR1_HUMAN Cannabinoid receptor Cannabinoid receptor 1 (brain)
Type:
G Protein-Coupled Receptor (GPCR)
Mol. Mass.:
52868.96
Organism:
Homo sapiens (Human)
Description:
P21554
Residue:
472
  
Inhibitor
Name:
BDBM143555
Synonyms:
US9682955, 68
Type:
Small organic molecule
Emp. Form.:
C34H28Cl2N4O3
Mol. Mass.:
611.517
SMILES:
OC(=O)c1ccc(cc1)C(=O)N1CCC(CC1)Nc1ncnc2ccc(cc12)C(c1ccc(Cl)cc1)c1ccc(Cl)cc1
: