Target
Cannabinoid receptor 2
Ligand
BDBM143524
Substrate
Meas. Tech.
cAMP Assay
Temperature
300.15±n/a K
EC50
>10000±n/a nM
Comments
extracted
Citation
 Macielag, MJZhang, YDeCorte, BLGreco, MN Quinazoline derivatives useful as CB-1 inverse agonists US Patent  US9682955 Publication Date 6/20/2017 
Target
Name:
Cannabinoid receptor 2
Synonyms:
CANNABINOID CB2 CB2 CB2B CNR2_HUMAN Cannabinoid CB2 receptor Cannabinoid receptor 2 (CB2R) | hCB2
Type:
G Protein-Coupled Receptor (GPCR)
Mol. Mass.:
39690.94
Organism:
Homo sapiens (Human)
Description:
P34972
Residue:
360
  
Inhibitor
Name:
BDBM143524
Synonyms:
US9682955, 72
Type:
Small organic molecule
Emp. Form.:
C31H25Cl2F3N4O
Mol. Mass.:
597.458
SMILES:
NCCOc1nc(NCc2ccc(cc2)C(F)(F)F)c2cc(ccc2n1)C(c1ccc(Cl)cc1)c1ccc(Cl)cc1
: