Target
Cannabinoid receptor 1
Ligand
BDBM143534
Substrate
Meas. Tech.
cAMP Assay
Temperature
300.15±n/a K
EC50
2.00±n/a nM
Comments
extracted
Citation
 Macielag, MJZhang, YDeCorte, BLGreco, MN Quinazoline derivatives useful as CB-1 inverse agonists US Patent  US9682955 Publication Date 6/20/2017 
Target
Name:
Cannabinoid receptor 1
Synonyms:
CANN6 CB-R CNR CNR1_HUMAN Cannabinoid receptor Cannabinoid receptor 1 (brain)
Type:
G Protein-Coupled Receptor (GPCR)
Mol. Mass.:
52868.96
Organism:
Homo sapiens (Human)
Description:
P21554
Residue:
472
  
Inhibitor
Name:
BDBM143534
Synonyms:
US9682955, 81
Type:
Small organic molecule
Emp. Form.:
C32H32Cl2N4O3
Mol. Mass.:
591.527
SMILES:
CCOC(=O)CCC(=O)N1CCC(CC1)Nc1ncnc2ccc(cc12)C(c1ccc(Cl)cc1)c1ccc(Cl)cc1
: