Target
UDP-3-O-acyl-N-acetylglucosamine deacetylase
Ligand
BDBM135571
Substrate
Meas. Tech.
Enzyme Assay
pH
8±n/a
IC50
0.441±n/a nM
Comments
extracted
Citation
 Brown, MFMarfat, AMelnick, MJReilly, U C-linked hydroxamic acid derivatives useful as antibacterial agents US Patent  US8853258 Publication Date 10/7/2014 
Target
Name:
UDP-3-O-acyl-N-acetylglucosamine deacetylase
Synonyms:
LPXC_PSEAE UDP-3-O-[3-hydroxymyristoyl] N-acetylglucosamine deacetylase UDP-3-O-[3-hydroxymyristoyl] N-acetylglucosamine deacetylase (LpxC) UDP-3-O-acyl-GlcNAc deacetylase (LpxC) lpxC
Type:
Enzyme
Mol. Mass.:
33428.15
Organism:
Pseudomonas aeruginosa
Description:
P47205
Residue:
303
  
Inhibitor
Name:
BDBM135571
Synonyms:
US8853258, 224
Type:
Small organic molecule
Emp. Form.:
C18H25NO4S
Mol. Mass.:
351.46
SMILES:
CC(CCc1ccc(cc1)C1=CCCCC1)(C(=O)NO)S(C)(=O)=O
: