Target
Melanocyte-stimulating hormone receptor
Ligand
BDBM135769
Substrate
Meas. Tech.
Competitive Inhibition Assay
pH
7.5±n/a
Ki
688±n/a nM
Comments
extracted
Citation
 Shi, YSharma, SDDodd, JHYang, WChen, X Melanocortin receptor-specific peptides US Patent  US8846601 Publication Date 9/30/2014 
Target
Name:
Melanocyte-stimulating hormone receptor
Synonyms:
MC1-R MSH-R MSHR_HUMAN Melanocortin receptor (M1 and M4) Melanocortin receptor 1 (MC1-R) | Melanocortin receptor 1 (MC1R)
Type:
Enzyme
Mol. Mass.:
34717.23
Organism:
Homo sapiens (Human)
Description:
Q01726
Residue:
317
  
Inhibitor
Name:
BDBM135769
Synonyms:
US10179804, Example 154 US8846601, 154 US9458201, 154
Type:
Small organic molecule
Emp. Form.:
C48H69N17O10
Mol. Mass.:
1044.1694
SMILES:
CC(=O)N[C@@H](CCCNC(N)=N)C(=O)N[C@H]1CCCNC(=O)CC[C@H](NC(=O)[C@H](Cc2c[nH]c3ccccc23)NC(=O)[C@H](CCCNC(N)=N)NC(=O)[C@@H](Cc2ccccc2)NC(=O)[C@H](CC(N)=O)NC1=O)C(N)=O
: