Target
5-hydroxytryptamine receptor 1A
Ligand
BDBM136321
Substrate
Meas. Tech.
Inhibition Assay
pH
7.4±n/a
Ki
0.59±n/a nM
Comments
extracted
Citation
 Andersson, JGyback, HJohansson, ALinde, CEMalmstrom, JNordvall, GWeigelt, TTerp, G 2-carboxamide-7-piperazinyl-benzofuran derivatives US Patent  US8859534 Publication Date 10/14/2014 
Target
Name:
5-hydroxytryptamine receptor 1A
Synonyms:
5-hydroxytryptamine receptor 1A (5HT1A)
Type:
Protein
Mol. Mass.:
46351.20
Organism:
Cricetulus griseus (Chinese hamster) (Cricetulus barabensis griseus)
Description:
G3I1B6
Residue:
422
  
Inhibitor
Name:
BDBM136321
Synonyms:
US8859534, 7
Type:
Small organic molecule
Emp. Form.:
C27H29N5O2
Mol. Mass.:
455.5515
SMILES:
CC(NC(=O)c1cc2cccc(N3CCN(CCc4ccccn4)CC3)c2o1)c1ccccn1
: