Target
5-hydroxytryptamine receptor 1A
Ligand
BDBM136324
Substrate
Meas. Tech.
Inhibition Assay
pH
7.4±n/a
Ki
0.38±n/a nM
Comments
extracted
Citation
 Andersson, JGyback, HJohansson, ALinde, CEMalmstrom, JNordvall, GWeigelt, TTerp, G 2-carboxamide-7-piperazinyl-benzofuran derivatives US Patent  US8859534 Publication Date 10/14/2014 
Target
Name:
5-hydroxytryptamine receptor 1A
Synonyms:
5-hydroxytryptamine receptor 1A (5HT1A)
Type:
Protein
Mol. Mass.:
46351.20
Organism:
Cricetulus griseus (Chinese hamster) (Cricetulus barabensis griseus)
Description:
G3I1B6
Residue:
422
  
Inhibitor
Name:
BDBM136324
Synonyms:
US8859534, 10
Type:
Small organic molecule
Emp. Form.:
C28H28N4O4
Mol. Mass.:
484.5463
SMILES:
O=C(NCc1ccc2OCOc2c1)c1cc2cccc(N3CCN(CCc4ccccn4)CC3)c2o1
: