Target
Cannabinoid receptor 2
Ligand
BDBM139889
Substrate
Meas. Tech.
Radioligand Binding Assays
Ki
0.15±n/a nM
Citation
 Frost, JMLatshaw, SPDart, MJCarroll, WAPerez-Medrano, AKolasa, TPatel, MVNelson, DWLi, TPeddi, SWang, XLiu, B Compounds as cannabinoid receptor ligands US Patent  US8895592 Publication Date 11/25/2014 
Target
Name:
Cannabinoid receptor 2
Synonyms:
CANNABINOID CB2 CB2 Cannabinoid CB2 receptor Cnr2 | rCB2
Type:
Enzyme
Mol. Mass.:
39366.68
Organism:
Rattus norvegicus (Rat)
Description:
Q9QZN9
Residue:
360
  
Inhibitor
Name:
BDBM139889
Synonyms:
US8895592, 19
Type:
Small organic molecule
Emp. Form.:
C21H27F3N2O3S
Mol. Mass.:
444.511
SMILES:
CC(C)Cn1cc(s\c1=N/C(=O)c1cc(ccc1OCCO)C(F)(F)F)C(C)(C)C
: