Target
C-C chemokine receptor type 2
Ligand
BDBM140252
Substrate
Meas. Tech.
Radioligand Binding Assay
pH
7.4±n/a
Temperature
277.15±n/a K
Ki
69±n/a nM
IC50
100±n/a nM
Comments
extracted
Citation
 Meyer, MDWang, XGuo, TWei, RGWang, LJ Chemokine receptor antagonists US Patent  US8906911 Publication Date 12/9/2014 
Target
Name:
C-C chemokine receptor type 2
Synonyms:
C-C chemokine receptor type 2 (CCR2) CCR2_HUMAN Chemoattractant Cytokine Receptor 2 (CCR2) Monocyte chemotactic protein-1 (MCP-1)
Type:
Enzyme
Mol. Mass.:
41932.32
Organism:
Homo sapiens (Human)
Description:
P41597
Residue:
374
  
Inhibitor
Name:
BDBM140252
Synonyms:
US8906911, 61
Type:
Small organic molecule
Emp. Form.:
C26H35F3N4O2
Mol. Mass.:
492.5769
SMILES:
C[C@H]1COCC[C@@H]1N[C@@H]1C[C@H]2CCC[C@]2(C1)C(=O)N1C[C@@H]2C[C@H]1CN2c1cc(ccn1)C(F)(F)F
: