Target
Metabotropic glutamate receptor 5
Ligand
BDBM141508
Substrate
Meas. Tech.
Radioligand Binding Assay
pH
7.4±n/a
Temperature
298.15±n/a K
Ki
65±n/a nM
Comments
extracted
Citation
 Li, GZhou, HWeiss, JDoller, DBurns, JF Bicyclo[3.2.1]octyl amide derivatives and uses of same US Patent  US8921370 Publication Date 12/30/2014 
Target
Name:
Metabotropic glutamate receptor 5
Synonyms:
GPRC1E GRM5_HUMAN metabotropic glutamate 5 | metabotropic glutamate 5a
Type:
Enzyme
Mol. Mass.:
132484.72
Organism:
Homo sapiens (Human)
Description:
Residue:
1212
  
Inhibitor
Name:
BDBM141508
Synonyms:
US8921370, 171 | US9656975, 171
Type:
Small organic molecule
Emp. Form.:
C20H24N4O2S
Mol. Mass.:
384.495
SMILES:
Cc1csc(n1)C(=O)NC12CCC(C1)(CCC2)C(=O)Nc1cccc(C)n1
: