Target
Metabotropic glutamate receptor 5
Ligand
BDBM141510
Substrate
Meas. Tech.
Calcium Mobilization Assay
pH
7.4±n/a
Temperature
310.15±n/a K
IC50
38±n/a nM
Comments
extracted
Citation
 Li, GZhou, HWeiss, JDoller, DBurns, JF Bicyclo[3.2.1]octyl amide derivatives and uses of same US Patent  US8921370 Publication Date 12/30/2014 
Target
Name:
Metabotropic glutamate receptor 5
Synonyms:
GPRC1E GRM5_HUMAN metabotropic glutamate 5 | metabotropic glutamate 5a
Type:
Enzyme
Mol. Mass.:
132484.72
Organism:
Homo sapiens (Human)
Description:
Residue:
1212
  
Inhibitor
Name:
BDBM141510
Synonyms:
US8921370, 178 | US9656975, 178
Type:
Small organic molecule
Emp. Form.:
C21H25N5O2
Mol. Mass.:
379.4555
SMILES:
Cc1cccc(n1)C(=O)NC12CCC(C1)(CCC2)C(=O)Nc1ccnc(C)n1
: