Target
Epidermal growth factor receptor [T790M,L858R]
Ligand
BDBM202376
Substrate
Meas. Tech.
Omnia Assay Protocol for Potency Assessment Against EGFR (WT) and EGFR (T790M/L858R) Active Enzymes
pH
7.5±n/a
IC50
<1.000±n/a nM
Comments
extracted
Citation
 Lee, KNiu, DPetter, RCSingh, J Heteroaryl compounds and uses thereof US Patent  US10081606 Publication Date 9/25/2018 
Target
Name:
Epidermal growth factor receptor [T790M,L858R]
Synonyms:
EGFR EGFR_HUMAN ERBB1 Epidermal growth factor receptor (EGFR)(T790M/L858R) Epidermal growth factor receptor (T790M, L858R) Epidermal growth factor receptor(L858R, T790M) | HER1
Type:
Mol. Mass.:
134353.72
Organism:
Homo sapiens (Human)
Description:
P00533[T790M,L858R]
Residue:
1210
  
Inhibitor
Name:
BDBM202376
Synonyms:
US10081606, Compound I-8 US9765038, Compound I-8
Type:
Small organic molecule
Emp. Form.:
C22H21BrN4O5
Mol. Mass.:
501.33
SMILES:
COc1ccc(Nc2ncc(Br)c(Oc3cccc(NC(=O)C=C)c3)n2)c(OC)c1OC
: