Target
Epidermal growth factor receptor [T790M,L858R]
Ligand
BDBM202387
Substrate
Meas. Tech.
Omnia Assay Protocol for Potency Assessment Against EGFR (WT) and EGFR (T790M/L858R) Active Enzymes
pH
7.5±n/a
IC50
20.0±n/a nM
Comments
extracted
Citation
 Lee, KNiu, DPetter, RCSingh, J Heteroaryl compounds and uses thereof US Patent  US10081606 Publication Date 9/25/2018 
Target
Name:
Epidermal growth factor receptor [T790M,L858R]
Synonyms:
EGFR EGFR_HUMAN ERBB1 Epidermal growth factor receptor (EGFR)(T790M/L858R) Epidermal growth factor receptor (T790M, L858R) Epidermal growth factor receptor(L858R, T790M) | HER1
Type:
Mol. Mass.:
134353.72
Organism:
Homo sapiens (Human)
Description:
P00533[T790M,L858R]
Residue:
1210
  
Inhibitor
Name:
BDBM202387
Synonyms:
US10081606, Compound I-19 US9765038, Compound I-19
Type:
Small organic molecule
Emp. Form.:
C20H17FN4O3
Mol. Mass.:
380.3724
SMILES:
COc1ccccc1Nc1ncc(F)c(Oc2cccc(NC(=O)C=C)c2)n1
: