Target
Kynurenine/alpha-aminoadipate aminotransferase, mitochondrial
Ligand
BDBM107728
Substrate
Meas. Tech.
Inhibition Spectra Assay
Temperature
310.15±n/a K
IC50
81.6±n/a nM
Comments
extracted
Citation
 Dounay, ABMcAllister, LAParikh, VDRong, SVerhoest, PR KAT II inhibitors US Patent  US8933095 Publication Date 1/13/2015 
Target
Name:
Kynurenine/alpha-aminoadipate aminotransferase, mitochondrial
Synonyms:
2-aminoadipate aminotransferase AADAT Alpha-aminoadipate aminotransferase KAT2 Kynurenine aminotransferase II Kynurenine--oxoglutarate aminotransferase II Kynurenine--oxoglutarate transaminase II
Type:
Enzyme
Mol. Mass.:
47353.09
Organism:
Homo sapiens (Human)
Description:
Q8N5Z0
Residue:
425
  
Inhibitor
Name:
BDBM107728
Synonyms:
US8933095, 12
Type:
Small organic molecule
Emp. Form.:
C14H16N4O2
Mol. Mass.:
272.3024
SMILES:
Cc1c2C[C@H](N)C(=O)N(O)c2nn1Cc1ccccc1
: