Target
Kynurenine/alpha-aminoadipate aminotransferase, mitochondrial
Ligand
BDBM107731
Substrate
Meas. Tech.
Inhibition Spectra Assay
Temperature
310.15±n/a K
IC50
28.3±n/a nM
Comments
extracted
Citation
 Dounay, ABMcAllister, LAParikh, VDRong, SVerhoest, PR KAT II inhibitors US Patent  US8933095 Publication Date 1/13/2015 
Target
Name:
Kynurenine/alpha-aminoadipate aminotransferase, mitochondrial
Synonyms:
2-aminoadipate aminotransferase AADAT Alpha-aminoadipate aminotransferase KAT2 Kynurenine aminotransferase II Kynurenine--oxoglutarate aminotransferase II Kynurenine--oxoglutarate transaminase II
Type:
Enzyme
Mol. Mass.:
47353.09
Organism:
Homo sapiens (Human)
Description:
Q8N5Z0
Residue:
425
  
Inhibitor
Name:
BDBM107731
Synonyms:
US8933095, 15
Type:
Small organic molecule
Emp. Form.:
C14H16N4O3
Mol. Mass.:
288.3018
SMILES:
COc1ccc(Cn2cc3C[C@H](N)C(=O)N(O)c3n2)cc1
: