Target
Transient receptor potential cation channel subfamily V member 1
Ligand
BDBM144119
Substrate
Meas. Tech.
Activation Assay
IC50
12±n/a nM
Citation
 Dart, MJKym, PRVoight, EAShrestha, ADaanen, JFJinkerson, TKKeddy, RGPeddi, SGomtsyan, AKort, MEGfesser, GAWoller, KRNelson, DW TRPV1 antagonists US Patent  US8969325 Publication Date 3/3/2015 
Target
Name:
Transient receptor potential cation channel subfamily V member 1
Synonyms:
Capsaicin receptor Osm-9-like TRP channel 1 TRPV1_HUMAN Transient receptor potential cation channel subfamily V member 1 (TRPV1) Transient receptor potential cation channel subfamily V member 1(TRPV1) Vanilloid VR1 Vanilloid receptor 1 Vanilloid receptor 1 (VRI/TRPV1)
Type:
Protein
Mol. Mass.:
94960.75
Organism:
Homo sapiens (Human)
Description:
Q8NER1
Residue:
839
  
Inhibitor
Name:
BDBM144119
Synonyms:
US8969325, 320
Type:
Small organic molecule
Emp. Form.:
C22H20F5N3O3
Mol. Mass.:
469.4045
SMILES:
FCC1(CF)C[C@@H](NC(=O)Nc2ccc3CCC(=O)Nc3c2)c2ccc(cc2O1)C(F)(F)F
: