Target
Cytochrome P450 3A4
Ligand
BDBM50008760
Substrate
Meas. Tech.
Homogenous Time-Resolved Fluorescence Assay (HTRF)
pH
7.4±n/a
Temperature
298.15±n/a K
IC50
1.83±n/a nM
Comments
extracted
Citation
 Rew, Y Benzoic acid derivative MDM2 inhibitor for the treatment of cancer US Patent  US8952036 Publication Date 2/10/2015 
Target
Name:
Cytochrome P450 3A4
Synonyms:
Albendazole monooxygenase CP3A4_HUMAN CYP3A4 CYPIIIA4 Cytochrome P450 3A4 (CYP3A4) Nifedipine oxidase Taurochenodeoxycholate 6-alpha-hydroxylase
Type:
Enzyme
Mol. Mass.:
57349.57
Organism:
Homo sapiens (Human)
Description:
Residue:
503
  
Inhibitor
Name:
BDBM50008760
Synonyms:
CHEMBL3236364
Type:
Small organic molecule
Emp. Form.:
C29H36Cl2N2O4S
Mol. Mass.:
579.578
SMILES:
CC(C)(C)S(=O)(=O)C[C@H](C1CC1)N1[C@@H]([C@H](C[C@](C)(CC(N)=O)C1=O)c1cccc(Cl)c1)c1ccc(Cl)cc1
: