Target
Somatostatin receptor type 5
Ligand
BDBM144771
Substrate
Meas. Tech.
Radioligand Binding Assay
pH
7.6±n/a
Temperature
298.15±n/a K
Ki
2.37±n/a nM
Comments
extracted
Citation
 Dong, ZXShen, YKim, SH Somatostatin-dopamine chimeric analogs US Patent  US8952128 Publication Date 2/10/2015 
Target
Name:
Somatostatin receptor type 5
Synonyms:
SOMATOSTATIN SST5 SS5-R SSR5_HUMAN Somatostatin receptor type 5 (SSTR5)
Type:
Enzyme
Mol. Mass.:
39218.02
Organism:
Homo sapiens (Human)
Description:
P35346
Residue:
364
  
Inhibitor
Name:
BDBM144771
Synonyms:
US8952128, 29
Type:
Small organic molecule
Emp. Form.:
C95H123N19O9S2
Mol. Mass.:
1739.245
SMILES:
C[C@@H](O)[C@@H]1NC(=O)[C@H](CCCCN)NC(=O)[C@@H](Cc2c[nH]c3ccccc23)NC(=O)[C@H](Cc2ccncc2)NC(=O)[C@H](Cc2ccccc2)NC(=O)[C@H](CCCNC(N)=N)NC(=O)[C@@H](CCCCNC(=O)[C@H](Cc2ccccc2)NC1=O)N(CCSC[C@@H]1C[C@H]2[C@@H](Cc3c[nH]c4cccc2c34)N(C)C1)CCSC[C@@H]1C[C@H]2[C@@H](Cc3c[nH]c4cccc2c34)N(C)C1
: