Target
Apoptosis regulator Bcl-2
Ligand
BDBM144969
Substrate
Meas. Tech.
Time Resolved-Fluorescence Resonance Energy Transfer (TR-FRET) Assay
Temperature
298.15±n/a K
Ki
18.589±n/a nM
Comments
extracted
Citation
 Ding, HDoherty, GAElmore, SWHexamer, LKunzer, ARPark, CSong, XSouers, AJSullivan, GMTao, ZWang, LWendt, MDCzabotar, PELessene, GLColman, PM Apoptosis-inducing agents for the treatment of cancer and immune and autoimmune diseases US Patent  US8952157 Publication Date 2/10/2015 
Target
Name:
Apoptosis regulator Bcl-2
Synonyms:
Apoptosis regulator Bcl-2 Protein BCL-2 BCL2_HUMAN | Bcl-2 Protein
Type:
Homodimer or heterodimer
Mol. Mass.:
26269.11
Organism:
Homo sapiens (Human)
Description:
P10415
Residue:
239
  
Inhibitor
Name:
BDBM144969
Synonyms:
US8952157, 152 | US9303025, 152
Type:
Small organic molecule
Emp. Form.:
C48H55Cl2FN6O7S
Mol. Mass.:
949.956
SMILES:
CC1(C)CCC(CN2CCN(CC2)c2ccc(C(=O)NS(=O)(=O)c3ccc(NC4CCN(CC4)C4CCOCC4)c(c3)[N+]([O-])=O)c(Oc3c(F)cccc3Cl)c2)=C(C1)c1ccc(Cl)cc1
: