Target
Apoptosis regulator Bcl-2
Ligand
BDBM145202
Substrate
Meas. Tech.
Time Resolved-Fluorescence Resonance Energy Transfer (TR-FRET) Assay
Temperature
298.15±n/a K
Ki
<0.01±n/a nM
Comments
extracted
Citation
 Ding, HDoherty, GAElmore, SWHexamer, LKunzer, ARPark, CSong, XSouers, AJSullivan, GMTao, ZWang, LWendt, MDCzabotar, PELessene, GLColman, PM Apoptosis-inducing agents for the treatment of cancer and immune and autoimmune diseases US Patent  US8952157 Publication Date 2/10/2015 
Target
Name:
Apoptosis regulator Bcl-2
Synonyms:
Apoptosis regulator Bcl-2 Protein BCL-2 BCL2_HUMAN | Bcl-2 Protein
Type:
Homodimer or heterodimer
Mol. Mass.:
26269.11
Organism:
Homo sapiens (Human)
Description:
P10415
Residue:
239
  
Inhibitor
Name:
BDBM145202
Synonyms:
US8952157, 393 | US9303025, 393
Type:
Small organic molecule
Emp. Form.:
C46H54Cl3FN8O6S
Mol. Mass.:
972.393
SMILES:
CN(C)CC(=O)N1CCC(F)(COc2ncc(cc2Cl)S(=O)(=O)NC(=O)c2ccc(cc2Oc2cnc(N)c(Cl)c2)N2CCN(CC3=C(CC(C)(C)CC3)c3ccc(Cl)cc3)CC2)CC1
: