Target
Sodium channel protein type 9 subunit alpha
Ligand
BDBM145281
Substrate
Meas. Tech.
Electrophysiological Assay
Temperature
310.15±n/a K
IC50
0.3±n/a nM
Comments
extracted
Citation
 Andrez, JChowdhury, SDecker, SMDehnhardt, CMFocken, TGrimwood, MEHemeon, IWJia, QLi, JOrtwine, DFSafina, BSheng, TSun, SSutherlin, DPWilson, MSZenova, AY N-substituted benzamides and methods of use thereof US Patent  US8952169 Publication Date 2/10/2015 
Target
Name:
Sodium channel protein type 9 subunit alpha
Synonyms:
NENA Peripheral sodium channel 1 SCN9A_HUMAN Voltage-gated sodium channel subunit Nav1.7 hNE-Na
Type:
Protein
Mol. Mass.:
226375.97
Organism:
Homo sapiens (Human)
Description:
Q15858
Residue:
1988
  
Inhibitor
Name:
BDBM145281
Synonyms:
US8952169, 60 | US9771376, Example 60
Type:
Small organic molecule
Emp. Form.:
C22H28FNO4S
Mol. Mass.:
421.525
SMILES:
CS(=O)(=O)NC(=O)c1cc(C2CC2)c(OCC23CC4CC(CC(C4)C2)C3)cc1F
: