Target
Cyclin-dependent kinase 1
Ligand
BDBM148264
Substrate
Meas. Tech.
IMAP-FPT (Molecular Devices Trade Mark Technology) Endpoint Assay
Temperature
298.15±n/a K
IC50
>15000±n/a nM
Comments
extracted
Citation
 Brain, CTSung, MJLagu, B Pyrrolopyrimidine compounds and their uses US Patent  US8962630 Publication Date 2/24/2015 
Target
Name:
Cyclin-dependent kinase 1
Synonyms:
CDC2 CDK1 CDKN1 Cell division protein kinase 1 P34CDC2 | p34 protein kinase
Type:
Enzyme Subunit
Mol. Mass.:
34101.08
Organism:
Homo sapiens (Human)
Description:
P06493
Residue:
297
  
Inhibitor
Name:
BDBM148264
Synonyms:
7-cyclopentyl-N,N-dimethyl-2-((5-(piperazin-1-yl)pyridin-2-yl)amino)-7H-pyrrolo[2,3-d]pyrimidine-6-carboxamide LEE011 US10570141, Comparative Example 1 | US8962630, 74
Type:
Small organic molecule
Emp. Form.:
C23H30N8O
Mol. Mass.:
434.5373
SMILES:
CN(C)C(=O)c1cc2cnc(Nc3ccc(cn3)N3CCNCC3)nc2n1C1CCCC1
: