Target
cAMP and cAMP-inhibited cGMP 3',5'-cyclic phosphodiesterase 10A
Ligand
BDBM149477
Substrate
Meas. Tech.
Fluorescence Polarization Assay
Ki
0.04±n/a nM
Citation
 Breslin, MJCox, CDHartingh, TJPero, JRaheem, ITRossi, MVassallo, L Aryloxmethyl cyclopropane derivatives as PDE10 inhibitors US Patent  US8975261 Publication Date 3/10/2015 
Target
Name:
cAMP and cAMP-inhibited cGMP 3',5'-cyclic phosphodiesterase 10A
Synonyms:
3',5'-cyclic phosphodiesterase PDE10_HUMAN Phosphodiesterase 10A
Type:
Protein
Mol. Mass.:
88412.52
Organism:
Homo sapiens (Human)
Description:
Q9Y233
Residue:
779
  
Inhibitor
Name:
BDBM149477
Synonyms:
US8975261, I-42
Type:
Small organic molecule
Emp. Form.:
C24H20N6O
Mol. Mass.:
408.4552
SMILES:
Cn1cc(cn1)-c1cc2ccncc2nc1OC[C@H]1C[C@@H]1c1ccc2ncccc2n1
: