Target
Non-receptor tyrosine-protein kinase TYK2
Ligand
BDBM286338
Substrate
Meas. Tech.
JAK Caliper Enzyme Assay at 1 mM ATP
pH
7.4±n/a
Temperature
298.15±n/a K
IC50
146±n/a nM
Comments
extracted
Citation
 Coe, JWDehnhardt, CMJones, PSabnis, YAStrohbach, JWWakenhut, FMWhitlock, GA Pyrazolopyridines and pyrazolopyrimidines US Patent  US9518052 Publication Date 12/13/2016 
Target
Name:
Non-receptor tyrosine-protein kinase TYK2
Synonyms:
Non-receptor tyrosine-protein kinase TYK2 (TYK2) TYK2_HUMAN | Tyrosine-protein kinase TYK2
Type:
Protein
Mol. Mass.:
133666.03
Organism:
Homo sapiens (Human)
Description:
P29597
Residue:
1187
  
Inhibitor
Name:
BDBM286338
Synonyms:
US9518052, Example 148
Type:
Small organic molecule
Emp. Form.:
C23H23F4N5O3S
Mol. Mass.:
525.519
SMILES:
CN(c1ccccc1CNc1nc(cc(N)c1C=N)-c1cc(F)c(O)cc1CC(F)(F)F)S(C)(=O)=O
: