Target
Alpha-glucosidase MAL12
Ligand
BDBM152498
Substrate
Meas. Tech.
alpha-Glucosidase Assay
IC50
1.18e+4± 1.5e+2 nM
Citation
 Rahim, FMalik, FUllah, HWadood, AKhan, FJavid, MTTaha, MRehman, WUr Rehman, AKhan, KM Isatin based Schiff bases as inhibitors of a-glucosidase: Synthesis, characterization, in vitro evaluation and molecular docking studies. Bioorg Chem 60:42-8 (2015)  
Target
Name:
Alpha-glucosidase MAL12
Synonyms:
α-Glucosidase MAL12_YEAST Maltase | alpha-Glucosidase (α-Glucosidase)
Type:
Protein
Mol. Mass.:
68084.32
Organism:
Saccharomyces cerevisiae
Description:
P53341
Residue:
584
  
Inhibitor
Name:
BDBM152498
Synonyms:
(E)-N'-(6-bromo-2-oxoindolin-3-ylidene)-2- hydroxybenzohydrazide (14)
Type:
Small organic molecule
Emp. Form.:
C15H10BrN3O3
Mol. Mass.:
360.162
SMILES:
Oc1ccccc1C(=O)N\N=C1\C(=O)Nc2cc(Br)ccc12
: