Target
Acetyl-CoA carboxylase 1
Ligand
BDBM152877
Substrate
Meas. Tech.
Inhibition Assay
pH
7.5±n/a
IC50
7.4±n/a nM
Comments
extracted
Citation
 Griffith, DADow, RLBagley, SWSmith, A N1/N2-lactam acetyl-CoA carboxylase inhibitors US Patent  US8993586 Publication Date 3/31/2015 
Target
Name:
Acetyl-CoA carboxylase 1
Synonyms:
ACAC ACACA_HUMAN ACC1 Acetyl-CoA carboxylase 1 | Acetyl-CoA carboxylase 1 (ACC1)
Type:
Protein
Mol. Mass.:
265543.22
Organism:
Homo sapiens (Human)
Description:
Q13085
Residue:
2346
  
Inhibitor
Name:
BDBM152877
Synonyms:
US8993586, 56
Type:
Small organic molecule
Emp. Form.:
C25H31N5O3
Mol. Mass.:
449.5453
SMILES:
COc1ccc(C)c2[nH]c(cc12)C(=O)N1CCC2(CC1)Cc1cn(nc1C(=O)N2)C(C)(C)C
: