Target
Acetyl-CoA carboxylase 2
Ligand
BDBM152823
Substrate
Meas. Tech.
Inhibition Assay
IC50
8.9±n/a nM
Citation
 Griffith, DADow, RLBagley, SWSmith, A N1/N2-lactam acetyl-CoA carboxylase inhibitors US Patent  US8993586 Publication Date 3/31/2015 
Target
Name:
Acetyl-CoA carboxylase 2
Synonyms:
ACACB ACC-beta ACCB Acetyl-CoA carboxylase 2 Acetyl-CoA carboxylase 2 (ACC2)
Type:
Protein
Mol. Mass.:
276535.21
Organism:
Homo sapiens (Human)
Description:
O00763
Residue:
2458
  
Inhibitor
Name:
BDBM152823
Synonyms:
US8993586, 103
Type:
Small organic molecule
Emp. Form.:
C24H26ClN5O2
Mol. Mass.:
451.949
SMILES:
CC(C)(C)n1cc2CC3(CCN(CC3)C(=O)c3ccc4ccnc(Cl)c4c3)NC(=O)c2n1
: