Target
Epithelial discoidin domain-containing receptor 1
Ligand
BDBM286865
Substrate
Meas. Tech.
Binding Activity
Temperature
298.15±n/a K
IC50
110±n/a nM
Comments
extracted
Citation
 Murata, TKawada, HNiizuma, SHara, SHada, KShimada, HTanaka, HMio, T Quinazolinedione derivative US Patent  US9567304 Publication Date 2/14/2017 
Target
Name:
Epithelial discoidin domain-containing receptor 1
Synonyms:
CAK DDR1_HUMAN Discoidin domain-containing receptor 1 (DDR1) EDDR1 Epithelial discoidin domain receptor 1 (DDR1) Epithelial discoidin domain-containing receptor 1 (DDR1) Mammary carcinoma kinase 10 NTRK4 Protein-tyrosine kinase RTK 6 TRKE | Tyrosine-protein kinase CAK
Type:
Tyrosine-protein kinase
Mol. Mass.:
101130.02
Organism:
Homo sapiens (Human)
Description:
Q08345
Residue:
913
  
Inhibitor
Name:
BDBM286865
Synonyms:
7-(4-Amino-piperidin-1-ylmethyl)-8-chloro-3-(5-chloro-2-ethanesulfonyl-benzyl)-6-trifluoromethyl-1H-quinazoline-2,4-dione | US9567304, Compound F-140
Type:
Small organic molecule
Emp. Form.:
C24H25Cl2F3N4O4S
Mol. Mass.:
593.446
SMILES:
CCS(=O)(=O)c1ccc(Cl)cc1Cn1c(=O)[nH]c2c(Cl)c(CN3CCC(N)CC3)c(cc2c1=O)C(F)(F)F
: