Target
Fatty acid-binding protein, intestinal
Ligand
BDBM17636
Substrate
Meas. Tech.
Fluorophore Displacement Assay
Temperature
566.3±0 K
Ki
1.55e+4± 4e+2 nM
Citation
 Patil, RLaguerre, AWielens, JHeadey, SJWilliams, MLHughes, MLMohanty, BPorter, CJScanlon, MJ Characterization of two distinct modes of drug binding to human intestinal fatty acid binding protein. ACS Chem Biol 9:2526-34 (2014)  
Target
Name:
Fatty acid-binding protein, intestinal
Synonyms:
FABP2 FABPI_HUMAN Fatty acid-binding protein, intestinal Intestinal fatty acid-binding protein (hIFABP)
Type:
Protein
Mol. Mass.:
15207.56
Organism:
Homo sapiens (Human)
Description:
Residue:
132
  
Inhibitor
Name:
BDBM17636
Synonyms:
2-{[3-(trifluoromethyl)phenyl]amino}benzoic acid CHEMBL23588 Nichisedan US9271961, Flufenamic Acid
Type:
Small organic molecule
Emp. Form.:
C14H10F3NO2
Mol. Mass.:
281.2299
SMILES:
OC(=O)c1ccccc1Nc1cccc(c1)C(F)(F)F
: