Target
Polyunsaturated fatty acid lipoxygenase ALOX15B
Ligand
BDBM50222290
Substrate
Meas. Tech.
IC50 Assay
pH
7.3±n/a
Temperature
298.15±n/a K
IC50
>1.00e+5±n/a nM
Comments
extracted
Citation
 Mascayano, CEspinosa, VSepúlveda-Boza, SHoobler, EKPerry, SDiaz, GHolman, TR Enzymatic Studies of Isoflavonoids as Selective and Potent Inhibitors of Human Leukocyte 5-Lipo-Oxygenase. Chem Biol Drug Des 86:114-21 (2015)  
Target
Name:
Polyunsaturated fatty acid lipoxygenase ALOX15B
Synonyms:
15-LOX-2 15-Lipoxygenase-2 (15-LOX-2) ALOX15B Arachidonate 15-lipoxygenase, type II Epithelial 15-lipoxygenase-2 | LX15B_HUMAN
Type:
Protein
Mol. Mass.:
75850.40
Organism:
Homo sapiens (Human)
Description:
Residue:
676
  
Inhibitor
Name:
BDBM50222290
Synonyms:
3'-chloro-7,8-dihydroxyisoflavone IR-308
Type:
Small organic molecule
Emp. Form.:
C15H9ClO4
Mol. Mass.:
288.683
SMILES:
Oc1ccc2c(occ(-c3cccc(Cl)c3)c2=O)c1O
: