Target
Polyunsaturated fatty acid 5-lipoxygenase
Ligand
BDBM106775
Substrate
Meas. Tech.
IC50 Assay
pH
7.3±n/a
Temperature
298.15±n/a K
IC50
1.5e+3± 5e+2 nM
Comments
extracted
Citation
 Mascayano, CEspinosa, VSepúlveda-Boza, SHoobler, EKPerry, SDiaz, GHolman, TR Enzymatic Studies of Isoflavonoids as Selective and Potent Inhibitors of Human Leukocyte 5-Lipo-Oxygenase. Chem Biol Drug Des 86:114-21 (2015)  
Target
Name:
Polyunsaturated fatty acid 5-lipoxygenase
Synonyms:
5-LO 5-Lipoxygenase (5-LO) 5-Lipoygenase ALOX5 LOG5 | LOX5_HUMAN
Type:
Enzyme
Mol. Mass.:
77972.74
Organism:
Homo sapiens (Human)
Description:
Recombinant protein was purified from E. coli lysate. After ammonium sulfate precipitation and subsequent steps, the supernatant (S100) was used for 5-LO activity assay.
Residue:
674
  
Inhibitor
Name:
BDBM106775
Synonyms:
6,7‐dihydroxy‐3‐(4‐nitrophenyl)‐4H‐chromen‐4‐one IR-6
Type:
Small organic molecule
Emp. Form.:
C15H9NO6
Mol. Mass.:
299.2351
SMILES:
Oc1cc2occ(-c3ccc(cc3)[N+]([O-])=O)c(=O)c2cc1O
: