Target
Polyunsaturated fatty acid 5-lipoxygenase
Ligand
BDBM153379
Substrate
Meas. Tech.
IC50 Assay
pH
7.3±n/a
Temperature
298.15±n/a K
IC50
2.8e+2± 9e+1 nM
Comments
extracted
Citation
 Mascayano, CEspinosa, VSepúlveda-Boza, SHoobler, EKPerry, SDiaz, GHolman, TR Enzymatic Studies of Isoflavonoids as Selective and Potent Inhibitors of Human Leukocyte 5-Lipo-Oxygenase. Chem Biol Drug Des 86:114-21 (2015)  
Target
Name:
Polyunsaturated fatty acid 5-lipoxygenase
Synonyms:
5-LO 5-Lipoxygenase (5-LO) 5-Lipoygenase ALOX5 LOG5 | LOX5_HUMAN
Type:
Enzyme
Mol. Mass.:
77972.74
Organism:
Homo sapiens (Human)
Description:
Recombinant protein was purified from E. coli lysate. After ammonium sulfate precipitation and subsequent steps, the supernatant (S100) was used for 5-LO activity assay.
Residue:
674
  
Inhibitor
Name:
BDBM153379
Synonyms:
HIR-3
Type:
Small organic molecule
Emp. Form.:
C16H16O3
Mol. Mass.:
256.2964
SMILES:
Cc1ccc(cc1)C1COc2cc(O)c(O)cc2C1
: